BDBM50073733 (R)-(1-Isothiocyanatoethyl)Benzene::CHEMBL2151314
SMILES C[C@@H](N=C=S)c1ccccc1
InChI Key InChIKey=QQCJPTVZIZVKEZ-MRVPVSSYSA-N
Data  1 IC50
  Tab Delimited (TSV)   2D SDfile   Computed 3D by Vconf -m prep SDfile
Find this compound or compounds like it in BindingDB:
Activity Spreadsheet -- Enzyme Inhibition Constant Data from BindingDB
Found 1 hit for monomerid = 50073733
TargetMacrophage migration inhibitory factor(Homo sapiens (Human))
University Of Otago
Curated by ChEMBL
LigandPNGBDBM50073733((R)-(1-Isothiocyanatoethyl)Benzene | CHEMBL2151314)
Affinity DataIC50:  1.10E+3nM. Assay description: Inhibition of macrophage migration inhibitory factor tautomerase activity in human Jurkat T cells using L-dopachrome methyl ester as substrate incuba...
In DepthDetails ArticlePubMed