BDBM50075277 (2R,3S)-N-(5-Amino-[1,3]dioxan-2-ylmethyl)-3-(1H-indol-3-yl)-N-methyl-2-[2-oxo-3-(3-phenyl-propyl)-imidazolidin-1-yl]-butyramide::CHEMBL356717
SMILES C[C@H]([C@@H](N1CCN(CCCc2ccccc2)C1=O)C(=O)N(C)C[C@H]1OC[C@H](N)CO1)c1c[nH]c2ccccc12
InChI Key InChIKey=JPOFLPAPXHQXEJ-LNOYQOGMSA-N
Data  1 KI
  Tab Delimited (TSV)   2D SDfile   Computed 3D by Vconf -m prep SDfile
Find this compound or compounds like it in BindingDB:
Activity Spreadsheet -- Enzyme Inhibition Constant Data from BindingDB
Found 1 hit for monomerid = 50075277
TargetSomatostatin receptor type 2(Homo sapiens (Human))
Merck Research Laboratories
Curated by ChEMBL
LigandPNGBDBM50075277((2R,3S)-N-(5-Amino-[1,3]dioxan-2-ylmethyl)-3-(1H-i...)
Affinity DataKi:  11nM. Assay description: In vitro binding affinity was evaluated against human Somatostatin receptor type 2 (hSSTR-2)
In DepthDetails ArticlePubMed