BDBM50078123 CHEMBL3417526
SMILES CN(C)C(=O)Cn1cc(cn1)-c1nc(no1)[C@](C)(C1CC1)c1ccc(cc1)-c1cnc(N)cn1
InChI Key InChIKey=CKXBFLPTMVEEMW-DEOSSOPVSA-N
Data  2 IC50
  Tab Delimited (TSV)   2D SDfile   Computed 3D by Vconf -m prep SDfile
Find this compound or compounds like it in BindingDB:
Activity Spreadsheet -- Enzyme Inhibition Constant Data from BindingDB
Found 2 hits for monomerid = 50078123
TargetArachidonate 5-lipoxygenase-activating protein(Homo sapiens (Human))
Boehringer Ingelheim Pharmaceuticals
Curated by ChEMBL
LigandPNGBDBM50078123(CHEMBL3417526)
Affinity DataIC50:  1.20nM. Assay description: Displacement of [125I]-L-691831 from human FLAP expressed in insect SF9 cell membranes after 2 hrs by Topcount analysis
In DepthDetails ArticlePubMed
TargetArachidonate 5-lipoxygenase-activating protein(Homo sapiens (Human))
Boehringer Ingelheim Pharmaceuticals
Curated by ChEMBL
LigandPNGBDBM50078123(CHEMBL3417526)
Affinity DataIC50:  73nM. Assay description: Inhibition of FLAP in calcimycin-stimulated human whole blood assessed as inhibition of LTB4 synthesis preincubated for 15 mins followed by calcimyci...
In DepthDetails ArticlePubMed