BDBM50081431 7,16-dihydroxy-5,14-dimethyl-(1S,13S,16R)-2-oxa-14-azatetracyclo[11.2.1.01,10.03,8]hexadeca-3,5,7,10-tetraene-9,15-dione
SMILES CN1C2CC=C3C(=O)c4c(O)cc(C)cc4O[C@@]3([C@@H]2O)C1=O
InChI Key InChIKey=SOHNEJINHDIELZ-PUXWDAROSA-N
Data  2 IC50
  Tab Delimited (TSV)   2D SDfile   Computed 3D by Vconf -m prep SDfile
Find this compound or compounds like it in BindingDB:
Activity Spreadsheet -- Enzyme Inhibition Constant Data from BindingDB
Found 2 hits for monomerid = 50081431
TargetDNA topoisomerase 2(Drosophila melanogaster)
Ajinomoto
Curated by ChEMBL
LigandPNGBDBM50081431(7,16-dihydroxy-5,14-dimethyl-(1S,13S,16R)-2-oxa-14...)
Affinity DataIC50: >3.00E+5nM. Assay description: In vitro inhibitory activity against topoisomerase II (Topo II) by using decatenation assay
Ligand InfoPC cidPC sid
In DepthDetails ArticlePubMed
TargetDNA topoisomerase 1(Mus musculus)
Ajinomoto
Curated by ChEMBL
LigandPNGBDBM50081431(7,16-dihydroxy-5,14-dimethyl-(1S,13S,16R)-2-oxa-14...)
Affinity DataIC50: >3.00E+5nM. Assay description: In vitro inhibitory activity against topoisomerase I (Topo I) by using relaxation assay
Ligand InfoPC cidPC sid
In DepthDetails ArticlePubMed