BDBM50083555 CHEMBL3423404
SMILES [H][C@]12CC[C@@H](CN1CCc1c2[nH]c2ccccc12)C(=O)N[C@@H](CCCC)C(=O)N[C@@H](Cc1ccc(O)cc1)C(=O)N[C@@H](CCCCN)C(N)=O
InChI Key InChIKey=KMGVERQIRHTKMX-MAKWBINYSA-N
Data  4 Kd
  Tab Delimited (TSV)   2D SDfile   Computed 3D by Vconf -m prep SDfile
Find this compound or compounds like it in BindingDB:
Activity Spreadsheet -- Enzyme Inhibition Constant Data from BindingDB
Found 4 hits for monomerid = 50083555
TargetD(2) dopamine receptor(Homo sapiens (Human))
University Of Barcelona
Curated by ChEMBL
LigandPNGBDBM50083555(CHEMBL3423404)
Affinity DataKd:  4.70E+3nM. Assay description: Displacement of [3H]-YM09151-2 from dopamine D2 receptor (unknown origin) expressed in sheep striatum membranes assessed as high affinity constant af...
In DepthDetails ArticlePubMed
TargetAdenosine receptor A2a(Homo sapiens (Human))
University Of Barcelona
Curated by ChEMBL
LigandPNGBDBM50083555(CHEMBL3423404)
Affinity DataKd:  6.00E+4nM. Assay description: Displacement of [3H]-ZM241385 from adenosine A2 receptor (unknown origin) expressed in sheep striatum membranes after 1.5 hrs by scintillation counti...
In DepthDetails ArticlePubMed
TargetAdenosine receptor A1(Homo sapiens (Human))
University Of Barcelona
Curated by ChEMBL
LigandPNGBDBM50083555(CHEMBL3423404)
Affinity DataKd: >1.00E+5nM. Assay description: Displacement of [3H]-R-PIA from adenosine A1 receptor (unknown origin) expressed in sheep striatum membranes after 2 hrs by scintillation counting an...
In DepthDetails ArticlePubMed
TargetD(1A) dopamine receptor(Homo sapiens (Human))
University Of Barcelona
Curated by ChEMBL
LigandPNGBDBM50083555(CHEMBL3423404)
Affinity DataKd:  1.20E+3nM. Assay description: Displacement of [3H]-SCH23390 from dopamine D1 receptor (unknown origin) expressed in sheep striatum membranes after 1.5 hrs by scintillation countin...
In DepthDetails ArticlePubMed