BDBM50084206 (R)-1-(4-Butoxy-benzenesulfonyl)-4-[(Z)-methoxyimino]-pyrrolidine-2-carboxylic acid hydroxyamide::CHEMBL149977
SMILES CCCCOc1ccc(cc1)S(=O)(=O)N1C\C(C[C@@H]1C(=O)NO)=N/OC
InChI Key InChIKey=OCZKLINSAMKTBK-PWDRBQJJSA-N
Data  4 IC50
  Tab Delimited (TSV)   2D SDfile   Computed 3D by Vconf -m prep SDfile
Find this compound or compounds like it in BindingDB:
Activity Spreadsheet -- Enzyme Inhibition Constant Data from BindingDB
Found 4 hits for monomerid = 50084206
TargetMatrilysin(Homo sapiens (Human))
University Of Florida
Curated by ChEMBL
LigandPNGBDBM50084206((R)-1-(4-Butoxy-benzenesulfonyl)-4-[(Z)-methoxyimi...)
Affinity DataIC50:  89nM. Assay description: In vitro inhibition of matrilysin (Matrix metalloproteinase-7, MMP-7)
In DepthDetails ArticlePubMed
TargetCollagenase 3(Homo sapiens (Human))
University Of Florida
Curated by ChEMBL
LigandPNGBDBM50084206((R)-1-(4-Butoxy-benzenesulfonyl)-4-[(Z)-methoxyimi...)
Affinity DataIC50:  0.300nM. Assay description: In vitro inhibition of human recombinant collagenase-3 (Matrix metalloproteinase-13)
In DepthDetails ArticlePubMed
TargetInterstitial collagenase(Homo sapiens (Human))
University Of Florida
Curated by ChEMBL
LigandPNGBDBM50084206((R)-1-(4-Butoxy-benzenesulfonyl)-4-[(Z)-methoxyimi...)
Affinity DataIC50:  26nM. Assay description: In vitro inhibition of human recombinant collagenase-1 (Matrix metalloproteinase-1, MMP-1)
In DepthDetails ArticlePubMed
TargetStromelysin-1(Homo sapiens (Human))
University Of Florida
Curated by ChEMBL
LigandPNGBDBM50084206((R)-1-(4-Butoxy-benzenesulfonyl)-4-[(Z)-methoxyimi...)
Affinity DataIC50:  1nM. Assay description: In vitro inhibition activity of human recombinant stromelysin (Matrix metalloproteinase-3)
In DepthDetails ArticlePubMed