BDBM50084974 CHEMBL3427402
SMILES Cc1cc(OC(F)(F)F)ccc1-c1c(Oc2ccc(\C=C\C(O)=O)cc2)c2ccc(O)cc2oc1=O
InChI Key InChIKey=SGOPFRYXITYBBT-NYYWCZLTSA-N
Data  5 IC50
  Tab Delimited (TSV)   2D SDfile   Computed 3D by Vconf -m prep SDfile
Find this compound or compounds like it in BindingDB:
Activity Spreadsheet -- Enzyme Inhibition Constant Data from BindingDB
Found 5 hits for monomerid = 50084974
TargetEstrogen receptor(Homo sapiens (Human))
Astrazeneca
Curated by ChEMBL
LigandPNGBDBM50084974(CHEMBL3427402)
Affinity DataIC50:  0.5nM. Assay description: Binding affinity to ER alpha (unknown origin) by LanthaScreen TR-FRET competitive binding assay
In DepthDetails ArticlePubMed
TargetPotassium voltage-gated channel subfamily H member 2(Homo sapiens (Human))
Astrazeneca
Curated by ChEMBL
LigandPNGBDBM50084974(CHEMBL3427402)
Affinity DataIC50: >1.00E+5nM. Assay description: Inhibition of hERG channel by electrophysiology
In DepthDetails ArticlePubMed
TargetEstrogen receptor(Homo sapiens (Human))
Astrazeneca
Curated by ChEMBL
LigandPNGBDBM50084974(CHEMBL3427402)
Affinity DataIC50:  3.90nM. Assay description: Agonist activity at ER alpha in human MCF7 cells assessed as PR gene expression after 24 hrs by laser scanning imaging cytometer analysis
In DepthDetails ArticlePubMed
TargetEstrogen receptor(Homo sapiens (Human))
Astrazeneca
Curated by ChEMBL
LigandPNGBDBM50084974(CHEMBL3427402)
Affinity DataIC50:  3.90nM. Assay description: Antagonist activity at ER alpha in human MCF7 cells assessed as inhibition of estradiol-induced PR expression treated for 24 hrs after incubation wit...
In DepthDetails ArticlePubMed
TargetEstrogen receptor(Homo sapiens (Human))
Astrazeneca
Curated by ChEMBL
LigandPNGBDBM50084974(CHEMBL3427402)
Affinity DataIC50:  2.70nM. Assay description: Suppression of ER alpha in human MCF7 cells after 24 hrs by immunostaining analysis
In DepthDetails ArticlePubMed