BDBM50085361 CHEMBL59998::N-((S)-1-Benzyl-3-chloro-2-oxo-propyl)-3-(3-hydroxy-phenyl)-propionamide
SMILES Oc1cccc(CCC(=O)N[C@@H](Cc2ccccc2)C(=O)CCl)c1
InChI Key InChIKey=QHVYHCDWMCLHQB-KRWDZBQOSA-N
Data  5 IC50
  Tab Delimited (TSV)   2D SDfile   Computed 3D by Vconf -m prep SDfile
Find this compound or compounds like it in BindingDB:
Activity Spreadsheet -- Enzyme Inhibition Constant Data from BindingDB
Found 5 hits for monomerid = 50085361
TargetCathepsin G(Homo sapiens (Human))
Kyoto Pharmaceutical University
Curated by ChEMBL
LigandPNGBDBM50085361(CHEMBL59998 | N-((S)-1-Benzyl-3-chloro-2-oxo-propy...)
Affinity DataIC50:  5.80E+4nM. Assay description: Inhibitory activity against human leukocyte cathepsin G
In DepthDetails ArticlePubMed
TargetChymotrypsin-like elastase family member 2A(Sus scrofa)
Kyoto Pharmaceutical University
Curated by ChEMBL
LigandPNGBDBM50085361(CHEMBL59998 | N-((S)-1-Benzyl-3-chloro-2-oxo-propy...)
Affinity DataIC50: >1.00E+6nM. Assay description: Inhibitory activity against porcine pancreatic elastase (PPE)
In DepthDetails ArticlePubMed
TargetTrypsin(Sus scrofa)
Kyoto Pharmaceutical University
Curated by ChEMBL
LigandPNGBDBM50085361(CHEMBL59998 | N-((S)-1-Benzyl-3-chloro-2-oxo-propy...)
Affinity DataIC50:  7.50E+4nM. Assay description: Inhibitory activity against porcine pancreatic trypsin (TRP)
In DepthDetails ArticlePubMed
TargetChymase(Homo sapiens (Human))
Kyoto Pharmaceutical University
Curated by ChEMBL
LigandPNGBDBM50085361(CHEMBL59998 | N-((S)-1-Benzyl-3-chloro-2-oxo-propy...)
Affinity DataIC50:  1.80E+3nM. Assay description: Inhibitory activity against human serine protease chymase
In DepthDetails ArticlePubMed
TargetChymotrypsinogen A(Bos taurus (bovine))
Kyoto Pharmaceutical University
Curated by ChEMBL
LigandPNGBDBM50085361(CHEMBL59998 | N-((S)-1-Benzyl-3-chloro-2-oxo-propy...)
Affinity DataIC50:  5.20E+3nM. Assay description: Inhibitory activity against alpha-chymotrypsin(alpha-CT)
In DepthDetails ArticlePubMed