BDBM50086504 2-Bromo-1,4,5-trihydroxy-3-oxo-cyclohexanecarboxylic acid anion
SMILES OC1CC(O)(C(Br)C(=O)C1O)C([O-])=O
InChI Key InChIKey=YAECDEPMCVIYIR-UHFFFAOYSA-M
Data  1 KI
  Tab Delimited (TSV)   2D SDfile   Computed 3D by Vconf -m prep SDfile
Find this compound or compounds like it in BindingDB:
Activity Spreadsheet -- Enzyme Inhibition Constant Data from BindingDB
Found 1 hit for monomerid = 50086504
Target3-dehydroquinate dehydratase(Escherichia coli (strain K12))
University Chemical Laboratory
Curated by ChEMBL
LigandPNGBDBM50086504(2-Bromo-1,4,5-trihydroxy-3-oxo-cyclohexanecarboxyl...)
Affinity DataKi:  3.70E+6nM. Assay description: Tested for the binding affinity against dehydroquinase
In DepthDetails ArticlePubMed