BDBM50086562 CHEMBL334360::NB-506 Analogue
SMILES OCC(CO)NN1C(=O)c2c(C1=O)c1c3ccc(O)cc3n([C@@H]3OC[C@@H](O)[C@H]3O)c1c1[nH]c3cc(O)ccc3c21
InChI Key InChIKey=KVRDNNFTUULNAQ-GRMVFTJISA-N
Data  1 IC50  1 EC50
  Tab Delimited (TSV)   2D SDfile   Computed 3D by Vconf -m prep SDfile
Find this compound or compounds like it in BindingDB:
Activity Spreadsheet -- Enzyme Inhibition Constant Data from BindingDB
Found 2 hits for monomerid = 50086562
TargetO94806/P05129/P05771/P17252/P24723/P41743/Q02156/Q04759/Q05513/Q05655/Q15139(Homo sapiens (Human))
Banyu Tsukuba Research Institute
Curated by ChEMBL
LigandPNGBDBM50086562(CHEMBL334360 | NB-506 Analogue)
Affinity DataIC50:  1.20E+4nM. Assay description: Inhibitory effect on protein kinase C using histone II-As as substrate
In DepthDetails ArticlePubMed
TargetDNA topoisomerase 1(Homo sapiens (Human))
Banyu Tsukuba Research Institute
Curated by ChEMBL
LigandPNGBDBM50086562(CHEMBL334360 | NB-506 Analogue)
Affinity DataEC50:  40nM. Assay description: Inhibitory effect on topoisomerase-I mediated DNA cleavage using supercoiled pBR322 plasmid DNA
In DepthDetails ArticlePubMed