BDBM50086850 (2E,4E)-Hexa-2,4-dienedioic acid (3,4-dichloro-phenyl)-amide (2,2,6,6-tetramethyl-piperidin-4-yl)-amide::CHEMBL148720
SMILES CC1(C)CC(CC(C)(C)N1)NC(=O)\C=C\C=C\C(=O)Nc1ccc(Cl)c(Cl)c1
InChI Key InChIKey=FIFZDWIUHFWXLX-KQQUZDAGSA-N
Data  1 IC50
  Tab Delimited (TSV)   2D SDfile   Computed 3D by Vconf -m prep SDfile
Find this compound or compounds like it in BindingDB:
Activity Spreadsheet -- Enzyme Inhibition Constant Data from BindingDB
Found 1 hit for monomerid = 50086850
TargetVacuolar proton pump subunit B(Gallus gallus)
Astrazeneca R & D M£Lndal
Curated by ChEMBL
LigandPNGBDBM50086850((2E,4E)-Hexa-2,4-dienedioic acid (3,4-dichloro-phe...)
Affinity DataIC50:  1.50E+3nM. Assay description: Compound was tested for in vitro inhibition of osteoclast vacuolar acid pump
In DepthDetails ArticlePubMed