BDBM50087105 1-{[3-Biphenyl-4-yl-2-(1-carboxy-2-phenyl-ethylcarbamoyl)-propyl]-hydroxy-phosphinoyl}-ethyl-ammonium
SMILES CC([NH3+])P(O)(=O)C[C@@H](Cc1ccc(cc1)-c1ccccc1)C(=O)N[C@@H](Cc1ccccc1)C(O)=O
InChI Key InChIKey=YXKSGWYTMCYAQI-CFAJLAAASA-O
Data  2 KI
  Tab Delimited (TSV)   2D SDfile   Computed 3D by Vconf -m prep SDfile
Find this compound or compounds like it in BindingDB:
Activity Spreadsheet -- Enzyme Inhibition Constant Data from BindingDB
Found 2 hits for monomerid = 50087105
TargetAminopeptidase N(Sus scrofa (Pig))
University Of Paris
Curated by ChEMBL
LigandPNGBDBM50087105(1-{[3-Biphenyl-4-yl-2-(1-carboxy-2-phenyl-ethylcar...)
Affinity DataKi:  3.70nM. Assay description: Inhibitory activity on aminopeptidase N (APN) using Ala-pNA as substrate.
In DepthDetails ArticlePubMed
TargetNeprilysin(Oryctolagus cuniculus (rabbit))
University Of Paris
Curated by ChEMBL
LigandPNGBDBM50087105(1-{[3-Biphenyl-4-yl-2-(1-carboxy-2-phenyl-ethylcar...)
Affinity DataKi:  51nM. Assay description: Inhibitory activity on neutral endopeptidase (NEP) using DGNPA as substrate.
In DepthDetails ArticlePubMed