BDBM50087683 8-(4-tert-Butyl-cyclohexyl)-1-phenyl-1,3,8-triaza-spiro[4.5]decan-4-one::CHEMBL436243
SMILES CC(C)(C)[C@@H]1CC[C@@H](CC1)N1CCC2(CC1)N(CNC2=O)c1ccccc1
InChI Key InChIKey=OYFATNWHESZHAW-KDURUIRLSA-N
Data  4 KI
  Tab Delimited (TSV)   2D SDfile   Computed 3D by Vconf -m prep SDfile
Find this compound or compounds like it in BindingDB:
Activity Spreadsheet -- Enzyme Inhibition Constant Data from BindingDB
Found 4 hits for monomerid = 50087683
TargetNociceptin receptor(RAT)
F. Hoffmann-La Roche
Curated by ChEMBL
LigandPNGBDBM50087683(8-(4-tert-Butyl-cyclohexyl)-1-phenyl-1,3,8-triaza-...)
Affinity DataKi:  3.30nM. Assay description: Inhibition against binding of radioligand [leucyl-3H]-OFQ to membrane of human embryonic kidney 293 cells overexpressing rat Opioid receptor like 1
In DepthDetails ArticlePubMed
TargetMu-type opioid receptor(Rattus norvegicus (rat))
F. Hoffmann-La Roche
Curated by ChEMBL
LigandPNGBDBM50087683(8-(4-tert-Butyl-cyclohexyl)-1-phenyl-1,3,8-triaza-...)
Affinity DataKi:  6.70nM. Assay description: Inhibition against binding of radioligand [N-allyl-2-3-3H]-naloxone to membrane of baby hamster kidney cells infected with forest virus encoding the...
In DepthDetails ArticlePubMed
TargetKappa-type opioid receptor(Rattus norvegicus (rat))
F. Hoffmann-La Roche
Curated by ChEMBL
LigandPNGBDBM50087683(8-(4-tert-Butyl-cyclohexyl)-1-phenyl-1,3,8-triaza-...)
Affinity DataKi:  38nM. Assay description: Inhibition against binding of radioligand [N-allyl-2-3-3H]-naloxone to membrane of baby hamster kidney cells infected with forest virus encoding the...
In DepthDetails ArticlePubMed
TargetDelta-type opioid receptor(Rattus norvegicus (rat))
F. Hoffmann-La Roche
Curated by ChEMBL
LigandPNGBDBM50087683(8-(4-tert-Butyl-cyclohexyl)-1-phenyl-1,3,8-triaza-...)
Affinity DataKi:  450nM. Assay description: Inhibition against binding of radioligand [Ile5,6-3H]-deltorphin to membrane from baby hamster kidney cells infected with forest virus encoding the ...
In DepthDetails ArticlePubMed