BDBM50090382 4-Benzyloxy-N-hydroxy-3-(4-methoxy-benzenesulfonyl)-butyramide::CHEMBL45208
SMILES COc1ccc(cc1)S(=O)(=O)C(COCc1ccccc1)CC(=O)NO
InChI Key InChIKey=LBHXVNIHKACCKG-UHFFFAOYSA-N
Data  3 KI
  Tab Delimited (TSV)   2D SDfile   Computed 3D by Vconf -m prep SDfile
Find this compound or compounds like it in BindingDB:
Activity Spreadsheet -- Enzyme Inhibition Constant Data from BindingDB
Found 3 hits for monomerid = 50090382
Target72 kDa type IV collagenase(Homo sapiens (Human))
Rhone-Poulenc Rorer
Curated by ChEMBL
LigandPNGBDBM50090382(4-Benzyloxy-N-hydroxy-3-(4-methoxy-benzenesulfonyl...)
Affinity DataKi:  38nM. Assay description: In vitro inhibition of human recombinant Matrix metalloproteinase-2.
In DepthDetails ArticlePubMed
TargetStromelysin-1(Homo sapiens (Human))
Rhone-Poulenc Rorer
Curated by ChEMBL
LigandPNGBDBM50090382(4-Benzyloxy-N-hydroxy-3-(4-methoxy-benzenesulfonyl...)
Affinity DataKi:  1.43E+3nM. Assay description: In vitro inhibition of human recombinant Matrix metalloproteinase-3.
In DepthDetails ArticlePubMed
TargetInterstitial collagenase(Homo sapiens (Human))
Rhone-Poulenc Rorer
Curated by ChEMBL
LigandPNGBDBM50090382(4-Benzyloxy-N-hydroxy-3-(4-methoxy-benzenesulfonyl...)
Affinity DataKi: >1.00E+4nM. Assay description: In vitro inhibition of human recombinant Matrix metalloproteinase-1.
In DepthDetails ArticlePubMed