BDBM50091999 3-Hydroxy-naphthalene-2-carboxylic acid (4-chloro-phenyl)-amide::CHEMBL65653
SMILES Oc1cc2ccccc2cc1C(=O)Nc1ccc(Cl)cc1
InChI Key InChIKey=OHAXNCGNVGGWSO-UHFFFAOYSA-N
Data  1 IC50
  Tab Delimited (TSV)   2D SDfile   Computed 3D by Vconf -m prep SDfile
Find this compound or compounds like it in BindingDB:
Activity Spreadsheet -- Enzyme Inhibition Constant Data from BindingDB
Found 1 hit for monomerid = 50091999
TargetDNA polymerase catalytic subunit(Human herpesvirus 6A (strain Uganda-1102) (HHV-6 v...)
Pharmacia
Curated by ChEMBL
LigandPNGBDBM50091999(3-Hydroxy-naphthalene-2-carboxylic acid (4-chloro-...)
Affinity DataIC50:  6.90E+4nM. Assay description: Inhibitory activity against Human Cytomegalovirus (HCMV) polymerase
In DepthDetails ArticlePubMed