BDBM50092475 CHEMBL3586185
SMILES Clc1ccc(\C=C2\SC(=NC2=O)N2CCC[C@H]2C(=O)Nc2ccc3ncnc(Nc4cccc(Cl)c4)c3c2)cc1
InChI Key InChIKey=NOQCGSHSQWSZGC-ZHIQAQTNSA-N
Data  1 IC50
  Tab Delimited (TSV)   2D SDfile   Computed 3D by Vconf -m prep SDfile
Find this compound or compounds like it in BindingDB:
Activity Spreadsheet -- Enzyme Inhibition Constant Data from BindingDB
Found 1 hit for monomerid = 50092475
TargetEpidermal growth factor receptor(Homo sapiens (Human))
Soochow University
Curated by ChEMBL
LigandPNGBDBM50092475(CHEMBL3586185)
Affinity DataIC50:  7.60E+3nM. Assay description: Inhibition of recombinant EGFR (unknown origin) assessed as inhibition of autophosphorylation after 1 hr by DELFIA/Time-resolved fluorometry
In DepthDetails ArticlePubMed