BDBM50093796 Adamantane-1-carboxylic acid {1-[2-(4-methoxy-phenyl)-ethyl]-pyrrolidin-3-yl}-amide::CHEMBL315773
SMILES COc1ccc(CCN2CCC(C2)NC(=O)C23CC4CC(CC(C4)C2)C3)cc1
InChI Key InChIKey=QMORGAOOYAIOHF-UHFFFAOYSA-N
Data  2 KI  1 IC50
  Tab Delimited (TSV)   2D SDfile   Computed 3D by Vconf -m prep SDfile
Find this compound or compounds like it in BindingDB:
Activity Spreadsheet -- Enzyme Inhibition Constant Data from BindingDB
Found 3 hits for monomerid = 50093796
TargetSerotonin 2 (5-HT2) receptor(RAT)
Welfide
Curated by ChEMBL
LigandPNGBDBM50093796(Adamantane-1-carboxylic acid {1-[2-(4-methoxy-phen...)
Affinity DataKi:  11nM. Assay description: Binding affinity at 5-hydroxytryptamine 2 receptor from striata wistar rats by [3H]ketanserin displacement.
In DepthDetails ArticlePubMed
TargetAlpha-1A/Alpha-1B/Alpha-1D adrenergic receptor(Homo sapiens (Human))
Welfide
Curated by ChEMBL
LigandPNGBDBM50093796(Adamantane-1-carboxylic acid {1-[2-(4-methoxy-phen...)
Affinity DataKi:  110nM. Assay description: Ability to displace [3H]-Prazosin binding to Alpha-1 adrenergic receptor
In DepthDetails ArticlePubMed
Target5-hydroxytryptamine receptor 1A(Rattus norvegicus (rat))
Welfide
Curated by ChEMBL
LigandPNGBDBM50093796(Adamantane-1-carboxylic acid {1-[2-(4-methoxy-phen...)
Affinity DataIC50: >1.00E+3nM. Assay description: The compound was evaluated for the ability to displace [3H]- 8-OH -DPAT from 5-hydroxytryptamine 1A receptor ( striata of male wistar rats)
In DepthDetails ArticlePubMed