BDBM50094488 CHEMBL3589158
SMILES N#CCCn1c2ccccc2c2nc3nonc3nc12
InChI Key InChIKey=RHUKFVDTRQCUIC-UHFFFAOYSA-N
Data  2 KI
  Tab Delimited (TSV)   2D SDfile   Computed 3D by Vconf -m prep SDfile
Find this compound or compounds like it in BindingDB:
Activity Spreadsheet -- Enzyme Inhibition Constant Data from BindingDB
Found 2 hits for monomerid = 50094488
TargetCatenin beta-1(Homo sapiens (Human))
University Of Utah
Curated by ChEMBL
LigandPNGBDBM50094488(CHEMBL3589158)
Affinity DataKi:  3.90E+4nM. Assay description: Inhibition of N-terminally His6-tagged human beta-catenin (residues 138-686)/C-terminally biotinylated human Tcf4 (residues 7-51) interaction after 4...
In DepthDetails ArticlePubMed
TargetCatenin beta-1(Homo sapiens (Human))
University Of Utah
Curated by ChEMBL
LigandPNGBDBM50094488(CHEMBL3589158)
Affinity DataKi:  4.70E+4nM. Assay description: Inhibition of human wild-type beta-catenin (residues 138-686)/C-terminally fluorescein labeled human wild-type Tcf4 (residues 7-51) interaction after...
In DepthDetails ArticlePubMed