BDBM50096816 (S)-6-Amino-2-[(S)-2-{[1-(2,3-difluoro-benzyl)-piperidine-3-carbonyl]-amino}-3-(1H-indol-3-yl)-butyrylamino]-hexanoic acid tert-butyl ester::CHEMBL337445
SMILES C[C@H](C(NC(=O)C1CCCN(Cc2cccc(F)c2F)C1)C(=O)N[C@@H](CCCCN)C(=O)OC(C)(C)C)c1c[nH]c2ccccc12
InChI Key InChIKey=ZDNLRYDGPXLQJI-UPDHCXJQSA-N
Data  1 KI
  Tab Delimited (TSV)   2D SDfile   Computed 3D by Vconf -m prep SDfile
Find this compound or compounds like it in BindingDB:
Activity Spreadsheet -- Enzyme Inhibition Constant Data from BindingDB
Found 1 hit for monomerid = 50096816
TargetSomatostatin receptor type 2(Homo sapiens (Human))
Merck Research Laboratories
Curated by ChEMBL
LigandPNGBDBM50096816((S)-6-Amino-2-[(S)-2-{[1-(2,3-difluoro-benzyl)-pip...)
Affinity DataKi:  5.70nM. Assay description: Binding affinity to human somatostatin 2 receptor
In DepthDetails ArticlePubMed