BDBM50098803 CHEMBL3329937
SMILES CC[C@H](C)[C@H](NC(=O)[C@@H](NC(=O)[C@@H](NC(=O)[C@@H](NC(=O)[C@@H]1CCCN1C(=O)[C@H](Cc1cnc[nH]1)NC(=O)[C@@H]1CCCN1C(=O)CN)C(C)(C)C)[C@@H](C)CC)C(C)(C)C)C(=O)N[C@@H]([C@@H](C)O)C(=O)NCC(=O)N1[C@@H](CSC1(C)C)C(=O)N[C@@H](Cc1cnc[nH]1)C(=O)N[C@@H](CCC(O)=O)C(=O)N[C@@H](CCC(O)=O)C(O)=O
InChI Key
Data  2 Kd
  Tab Delimited (TSV)   2D SDfile   Computed 3D by Vconf -m prep SDfile
Find this compound or compounds like it in BindingDB:
Activity Spreadsheet -- Enzyme Inhibition Constant Data from BindingDB
Found 2 hits for monomerid = 50098803
TargetTyrosine-protein phosphatase non-receptor type 1(Homo sapiens (Human))
The Ohio State University
Curated by ChEMBL
LigandPNGBDBM50098803(CHEMBL3329937)
Affinity DataKd:  9.00E+3nM. Assay description: Binding affinity to PTP1B (unknown origin)
In DepthDetails ArticlePubMed
TargetTyrosine-protein phosphatase non-receptor type 6(Homo sapiens (Human))
The Ohio State University
Curated by ChEMBL
LigandPNGBDBM50098803(CHEMBL3329937)
Affinity DataKd: >1.50E+4nM. Assay description: Binding affinity to SHP1 (unknown origin)
In DepthDetails ArticlePubMed