BDBM50099188 (2S,5S)-3,3-Dimethyl-4,4,7-trioxo-6-((E)-4-oxo-pent-2-enyl)-4lambda*6*-thia-1-aza-bicyclo[3.2.0]heptane-2-carboxylic acid::CHEMBL6311
SMILES CC(=O)CC=CC1[C@H]2N([C@@H](C(O)=O)C(C)(C)S2(=O)=O)C1=O
InChI Key InChIKey=KKSAGQLHTXTMBB-PCFYAGROSA-N
Data  3 IC50
  Tab Delimited (TSV)   2D SDfile   Computed 3D by Vconf -m prep SDfile
Find this compound or compounds like it in BindingDB:
Activity Spreadsheet -- Enzyme Inhibition Constant Data from BindingDB
Found 3 hits for monomerid = 50099188
TargetBeta-lactamase TEM(Escherichia coli)
Wyeth-Ayerst Research
Curated by ChEMBL
LigandPNGBDBM50099188((2S,5S)-3,3-Dimethyl-4,4,7-trioxo-6-((E)-4-oxo-pen...)
Affinity DataIC50:  6.50E+3nM. Assay description: In vitro inhibitory concentration against TEM-1 enzyme
In DepthDetails ArticlePubMed
TargetBeta-lactamase(Escherichia coli)
Wyeth-Ayerst Research
Curated by ChEMBL
LigandPNGBDBM50099188((2S,5S)-3,3-Dimethyl-4,4,7-trioxo-6-((E)-4-oxo-pen...)
Affinity DataIC50:  4.00E+4nM. Assay description: In vitro inhibitory concentration against AmpC enzyme
In DepthDetails ArticlePubMed
TargetMetallo-beta-lactamase type 2(Bacteroides fragilis)
Wyeth-Ayerst Research
Curated by ChEMBL
LigandPNGBDBM50099188((2S,5S)-3,3-Dimethyl-4,4,7-trioxo-6-((E)-4-oxo-pen...)
Affinity DataIC50:  3.00E+3nM. Assay description: In vitro inhibitory concentration against CCRA enzyme
In DepthDetails ArticlePubMed