BDBM50099837 CHEMBL3319594
SMILES CCCC[C@H](NC(=O)[C@@H]1C[C@@H](O)CN1C(=O)[C@H](C)NC(=O)CN=[N+]=[N-])C(=O)N[C@@H](CC(C)C)C(=O)[C@@]1(C)CO1
InChI Key InChIKey=MPBCYSRMIUBLQM-QMMMGPOBSA-N
Data  1 IC50
  Tab Delimited (TSV)   2D SDfile   Computed 3D by Vconf -m prep SDfile
Find this compound or compounds like it in BindingDB:
Activity Spreadsheet -- Enzyme Inhibition Constant Data from BindingDB
Found 1 hit for monomerid = 50099837
TargetProteasome subunit beta type-9(Homo sapiens (Human))
Leiden Institute Of Chemistry And Netherlands Proteomics Centre
Curated by ChEMBL
LigandPNGBDBM50099837(CHEMBL3319594)
Affinity DataIC50:  170nM. Assay description: Inhibition of proteasome subunit beta-1i in human Raji cells using BODIPY- epoxomicin by fluorescent densitometry
In DepthDetails ArticlePubMed