BDBM50099952 CHEMBL3319603
SMILES CCCC[C@H](NC(=O)[C@@H]1CC(F)(F)CN1C(=O)[C@H](C)NC(=O)CN=[N+]=[N-])C(=O)N[C@@H](Cc1ccccc1)C(=O)[C@@]1(C)CO1
InChI Key InChIKey=TZRCNHKHFSFNER-MDEFBCHOSA-N
Data  2 IC50
  Tab Delimited (TSV)   2D SDfile   Computed 3D by Vconf -m prep SDfile
Find this compound or compounds like it in BindingDB:
Activity Spreadsheet -- Enzyme Inhibition Constant Data from BindingDB
Found 2 hits for monomerid = 50099952
TargetProteasome subunit beta type-10(Homo sapiens (Human))
Leiden Institute Of Chemistry And Netherlands Proteomics Centre
Curated by ChEMBL
LigandPNGBDBM50099952(CHEMBL3319603)
Affinity DataIC50: >1.00E+5nM. Assay description: Inhibition of proteasome subunit beta-2i in human Raji cells using BODIPY- epoxomicin by fluorescent densitometry
In DepthDetails ArticlePubMed
TargetProteasome subunit beta type-9(Homo sapiens (Human))
Leiden Institute Of Chemistry And Netherlands Proteomics Centre
Curated by ChEMBL
LigandPNGBDBM50099952(CHEMBL3319603)
Affinity DataIC50:  42nM. Assay description: Inhibition of proteasome subunit beta-1i in human Raji cells using BODIPY- epoxomicin by fluorescent densitometry
In DepthDetails ArticlePubMed