BDBM50100523 CHEMBL3327086
SMILES CCCCS(=O)(=O)N1CCC(CC1)NC(=O)Nc1ccc(cc1)C(F)(F)F
InChI Key InChIKey=QYIZKIYWRQWALF-UHFFFAOYSA-N
Data  1 KI  2 IC50
  Tab Delimited (TSV)   2D SDfile   Computed 3D by Vconf -m prep SDfile
Find this compound or compounds like it in BindingDB:
Activity Spreadsheet -- Enzyme Inhibition Constant Data from BindingDB
Found 3 hits for monomerid = 50100523
TargetBifunctional epoxide hydrolase 2(Homo sapiens (Human))
University Of California Davis
Curated by ChEMBL
LigandPNGBDBM50100523(CHEMBL3327086)
Affinity DataKi:  0.980nM. Assay description: Inhibition of human recombinant soluble epoxide hydrolase by FRET-based ACPU displacement assay
In DepthDetails ArticlePubMed
TargetBifunctional epoxide hydrolase 2(Mus musculus (Mouse))
The Regents Of The University Of California
US Patent
LigandPNGBDBM50100523(CHEMBL3327086)
Affinity DataIC50:  6.80nM. Assay description: fluoresence competitive assay.
In DepthDetails US Patent
TargetBifunctional epoxide hydrolase 2(Mus musculus (Mouse))
The Regents Of The University Of California
US Patent
LigandPNGBDBM50100523(CHEMBL3327086)
Affinity DataIC50:  27nM. Assay description: Trans-diphenylpropene oxide is used in a radiometric competitive assay.
In DepthDetails US Patent