BDBM50104762 CHEMBL3594150
SMILES [H][C@@]1([#6]-[#6@@H](-[#8])[C@@]2([#6])[#6]-3=[#6](-[#6](=O)-[#6][C@]12[#6])[C@@]1([#6])[#6]-[#6]-[#6](=O)C([#6])([#6])[C@]1([H])[#6]-[#6]-3)[#6@H](-[#6])-[#6]-[#6]\[#6]=[#6](\[#6]-[#8])-[#6]-[#8]
InChI Key InChIKey=NCWPXHMUBMRCHV-KEMHIYJBSA-N
Data  1 IC50
  Tab Delimited (TSV)   2D SDfile   Computed 3D by Vconf -m prep SDfile
Find this compound or compounds like it in BindingDB:
Activity Spreadsheet -- Enzyme Inhibition Constant Data from BindingDB
Found 1 hit for monomerid = 50104762
Target3-hydroxy-3-methylglutaryl-coenzyme A reductase(Sus scrofa)
Chinese Academy Of Sciences
Curated by ChEMBL
LigandPNGBDBM50104762(CHEMBL3594150)
Affinity DataIC50: >1.00E+5nM. Assay description: Inhibition of pig liver microsomes HMG-CoA reductase incubated for 5 mins in using HMG-CoA and NADPH by colorimetric method
In DepthDetails ArticlePubMed