BDBM50105132 CHEMBL544335::N2-(3-((12-((3-((4,6-Di(dimethylamino)-1,3,5-triazin-2-yl)amino)propyl)amino)dodecyl)amino)-propyl)N4,N4,N6N6-tetramethyl-1,3,5-triazine-4,2,6-triamine pentahydrochloride
SMILES CN(C)c1nc(NCCCNCCCCCCCCCCCCNCCCNc2nc(nc(n2)N(C)C)N(C)C)nc(n1)N(C)C
InChI Key InChIKey=YTSSZLNDLDPYLM-UHFFFAOYSA-N
Data  1 KI
  Tab Delimited (TSV)   2D SDfile   Computed 3D by Vconf -m prep SDfile
Find this compound or compounds like it in BindingDB:
Activity Spreadsheet -- Enzyme Inhibition Constant Data from BindingDB
Found 1 hit for monomerid = 50105132
TargetAdenosine transporter 1(Trypanosoma brucei)
Cardiff University
Curated by ChEMBL
LigandPNGBDBM50105132(CHEMBL544335 | N2-(3-((12-((3-((4,6-Di(dimethylami...)
Affinity DataKi:  2.50E+3nM. Assay description: Ability to inhibit adenosine uptake by the P2 transporter in Trypanosoma brucei
In DepthDetails ArticlePubMed