BDBM50108736 CHEMBL357712::[4-(4-Benzo[d]isoxazol-3-yl-piperazin-1-yl)-pyrimidin-2-yl]-methanol
SMILES OCc1nccc(n1)N1CCN(CC1)c1noc2ccccc12
InChI Key InChIKey=UIMBPSRKOZHAIK-UHFFFAOYSA-N
Data  2 IC50
  Tab Delimited (TSV)   2D SDfile   Computed 3D by Vconf -m prep SDfile
Find this compound or compounds like it in BindingDB:
Activity Spreadsheet -- Enzyme Inhibition Constant Data from BindingDB
Found 2 hits for monomerid = 50108736
TargetSorbitol dehydrogenase(Homo sapiens (Human))
Pfizer
Curated by ChEMBL
LigandPNGBDBM50108736(CHEMBL357712 | [4-(4-Benzo[d]isoxazol-3-yl-piperaz...)
Affinity DataIC50:  120nM. Assay description: Concentration required for 50% in vitro inhibition of recombinant human sorbitol dehydrogenase (h-SDH)
In DepthDetails ArticlePubMed
TargetSorbitol dehydrogenase(Homo sapiens (Human))
Pfizer
Curated by ChEMBL
LigandPNGBDBM50108736(CHEMBL357712 | [4-(4-Benzo[d]isoxazol-3-yl-piperaz...)
Affinity DataIC50:  410nM. Assay description: Concentration required for 50% in vitro inhibition in sheep liver sorbitol dehydrogenase (s-SDH)
In DepthDetails ArticlePubMed