BDBM50108745 1-[4-(4-Oxazolo[4,5-b]pyridin-2-yl-piperazin-1-yl)-pyrimidin-2-yl]-ethanol::CHEMBL147197
SMILES C[C@@H](O)c1nccc(n1)N1CCN(CC1)c1nc2ncccc2o1
InChI Key InChIKey=WCSXYDKLNGCJSL-LLVKDONJSA-N
Data  1 IC50
  Tab Delimited (TSV)   2D SDfile   Computed 3D by Vconf -m prep SDfile
Find this compound or compounds like it in BindingDB:
Activity Spreadsheet -- Enzyme Inhibition Constant Data from BindingDB
Found 1 hit for monomerid = 50108745
TargetSorbitol dehydrogenase(Homo sapiens (Human))
Pfizer
Curated by ChEMBL
LigandPNGBDBM50108745(1-[4-(4-Oxazolo[4,5-b]pyridin-2-yl-piperazin-1-yl)...)
Affinity DataIC50:  170nM. Assay description: Concentration required for 50% in vitro inhibition of recombinant human sorbitol dehydrogenase (h-SDH)
In DepthDetails ArticlePubMed