BDBM50108756 CHEMBL151268::{4-[4-(4,6-Dimethyl-pyrimidin-2-yl)-piperazin-1-yl]-pyrimidin-2-yl}-methanol
SMILES Cc1cc(C)nc(n1)N1CCN(CC1)c1ccnc(CO)n1
InChI Key InChIKey=KXEHNZFYMZBSFZ-UHFFFAOYSA-N
Data  2 IC50
  Tab Delimited (TSV)   2D SDfile   Computed 3D by Vconf -m prep SDfile
Find this compound or compounds like it in BindingDB:
Activity Spreadsheet -- Enzyme Inhibition Constant Data from BindingDB
Found 2 hits for monomerid = 50108756
TargetSorbitol dehydrogenase(Homo sapiens (Human))
Pfizer
Curated by ChEMBL
LigandPNGBDBM50108756(CHEMBL151268 | {4-[4-(4,6-Dimethyl-pyrimidin-2-yl)...)
Affinity DataIC50:  350nM. Assay description: Concentration required for 50% in vitro inhibition in sheep liver sorbitol dehydrogenase (s-SDH)
In DepthDetails ArticlePubMed
TargetSorbitol dehydrogenase(Homo sapiens (Human))
Pfizer
Curated by ChEMBL
LigandPNGBDBM50108756(CHEMBL151268 | {4-[4-(4,6-Dimethyl-pyrimidin-2-yl)...)
Affinity DataIC50:  93nM. Assay description: Concentration required for 50% in vitro inhibition of recombinant human sorbitol dehydrogenase (h-SDH)
In DepthDetails ArticlePubMed