BDBM50113237 1-Allyl-7-(2-chloro-ethyl)-3-methyl-8-phenyl-3,7-dihydro-purine-2,6-dione::CHEMBL67110
SMILES Cn1c2nc(-c3ccccc3)n(CCCl)c2c(=O)n(CC=C)c1=O
InChI Key InChIKey=FVAZHKWDYPFKQL-UHFFFAOYSA-N
Data  3 KI
  Tab Delimited (TSV)   2D SDfile   Computed 3D by Vconf -m prep SDfile
Find this compound or compounds like it in BindingDB:
Activity Spreadsheet -- Enzyme Inhibition Constant Data from BindingDB
Found 3 hits for monomerid = 50113237
TargetAdenosine receptor A2b(Homo sapiens (Human))
National Institute Of Diabetes & Digestive & Kidney Diseases
Curated by ChEMBL
LigandPNGBDBM50113237(1-Allyl-7-(2-chloro-ethyl)-3-methyl-8-phenyl-3,7-d...)
Affinity DataKi:  311nM. Assay description: Binding affinity at human Adenosine A2B receptor expressed in HEK-293 cells, using [125I]-ABOPX as radioligand
In DepthDetails ArticlePubMed
TargetAdenosine receptor A2b(Rattus norvegicus)
National Institute Of Diabetes & Digestive & Kidney Diseases
Curated by ChEMBL
LigandPNGBDBM50113237(1-Allyl-7-(2-chloro-ethyl)-3-methyl-8-phenyl-3,7-d...)
Affinity DataKi:  1.70E+3nM. Assay description: Inhibition of [125I]-APOBX binding to rat Adenosine A2B receptor expressed in HEK cells
In DepthDetails ArticlePubMed
TargetAdenosine receptor A2a(Rattus norvegicus (rat))
National Institute Of Diabetes & Digestive & Kidney Diseases
Curated by ChEMBL
LigandPNGBDBM50113237(1-Allyl-7-(2-chloro-ethyl)-3-methyl-8-phenyl-3,7-d...)
Affinity DataKi:  3.57E+3nM. Assay description: Binding affinity at rat Adenosine A2A receptor by [3H]-CGS- 21680 displacement.
In DepthDetails ArticlePubMed