BDBM50113262 CHEMBL3601436
SMILES O=c1cc(oc2c3OCOc3ccc12)-c1ccccc1
InChI Key InChIKey=GBOIYIBKDOOVMK-UHFFFAOYSA-N
Data  3 KI
  Tab Delimited (TSV)   2D SDfile   Computed 3D by Vconf -m prep SDfile
Find this compound or compounds like it in BindingDB:
Activity Spreadsheet -- Enzyme Inhibition Constant Data from BindingDB
Found 3 hits for monomerid = 50113262
TargetCytochrome P450 1A2(Homo sapiens (Human))
Xavier University Of Louisiana
Curated by ChEMBL
LigandPNGBDBM50113262(CHEMBL3601436)
Affinity DataKi:  90nM. Assay description: Inhibition of human microsomal CYP1A2-dependent methoxyresorufin-O-demethylase activity by spectrofluorimetric analysis in presence of NADPH regenera...
In DepthDetails ArticlePubMed
TargetCytochrome P450 1B1(Homo sapiens (Human))
Xavier University Of Louisiana
Curated by ChEMBL
LigandPNGBDBM50113262(CHEMBL3601436)
Affinity DataKi:  480nM. Assay description: Inhibition of human microsomal CYP1B1-dependent ethoxyresorufin-O-deethylase activity by spectrofluorimetric analysis in presence of NADPH regenerati...
In DepthDetails ArticlePubMed
TargetCytochrome P450 1A1(Homo sapiens (Human))
Xavier University Of Louisiana
Curated by ChEMBL
LigandPNGBDBM50113262(CHEMBL3601436)
Affinity DataKi:  1.23E+3nM. Assay description: Inhibition of human microsomal CYP1A1-dependent ethoxyresorufin-O-deethylase activity by spectrofluorimetric analysis in presence of NADPH regenerati...
In DepthDetails ArticlePubMed