BDBM50117583 1-Benzyl-4-(5,6-dimethoxy-1-oxo-indan-2-ylmethyl)-1-methyl-piperidinium::CHEMBL314989
SMILES COc1cc2CC(CC3CC[N+](C)(Cc4ccccc4)CC3)C(=O)c2cc1OC
InChI Key InChIKey=MNJMLCSCGCADPC-UHFFFAOYSA-N
Data  1 IC50  1 EC50
  Tab Delimited (TSV)   2D SDfile   Computed 3D by Vconf -m prep SDfile
Find this compound or compounds like it in BindingDB:
Activity Spreadsheet -- Enzyme Inhibition Constant Data from BindingDB
Found 2 hits for monomerid = 50117583
TargetAcetylcholinesterase(Homo sapiens (Human))
Organon Laboratories
Curated by ChEMBL
LigandPNGBDBM50117583(1-Benzyl-4-(5,6-dimethoxy-1-oxo-indan-2-ylmethyl)-...)
Affinity DataIC50:  25nM. Assay description: In vitro reversal of vecuronium-induced neuromuscular block in guinea pig hemi-diaphragm.
In DepthDetails ArticlePubMed
TargetAcetylcholinesterase(Homo sapiens (Human))
Organon Laboratories
Curated by ChEMBL
LigandPNGBDBM50117583(1-Benzyl-4-(5,6-dimethoxy-1-oxo-indan-2-ylmethyl)-...)
Affinity DataEC50:  100nM. Assay description: In vitro reversal of vecuronium-induced neuromuscular block in guinea pig hemi-diaphragm.
In DepthDetails ArticlePubMed