BDBM50117593 1-Benzyl-4-[(5,6-dimethoxy-1-oxo-indan-2-yl)-hydroxy-methyl]-pyridinium::CHEMBL87955
SMILES COc1cc2CC(C(O)c3cc[n+](Cc4ccccc4)cc3)C(=O)c2cc1OC
InChI Key InChIKey=SQTQNYMNESABEP-UHFFFAOYSA-N
Data  1 EC50
  Tab Delimited (TSV)   2D SDfile   Computed 3D by Vconf -m prep SDfile
Find this compound or compounds like it in BindingDB:
Activity Spreadsheet -- Enzyme Inhibition Constant Data from BindingDB
Found 1 hit for monomerid = 50117593
TargetAcetylcholinesterase(Homo sapiens (Human))
Organon Laboratories
Curated by ChEMBL
LigandPNGBDBM50117593(1-Benzyl-4-[(5,6-dimethoxy-1-oxo-indan-2-yl)-hydro...)
Affinity DataEC50:  1.88E+3nM. Assay description: In vitro reversal of vecuronium-induced neuromuscular block in guinea pig hemi-diaphragm.
In DepthDetails ArticlePubMed