BDBM50121447 5-Nitro-furan-2-carboxylic acid N'-(2-naphthalen-2-yl-acetyl)-hydrazide::5-Nitro-furan-2-carboxylic acidN'-(2-naphthalen-2-yl-acetyl)-hydrazide::CHEMBL120147
SMILES [O-][N+](=O)c1ccc(o1)C(=O)NNC(=O)Cc1ccc2ccccc2c1
InChI Key InChIKey=UCJQERPCMJXITB-UHFFFAOYSA-N
Data  2 IC50
  Tab Delimited (TSV)   2D SDfile   Computed 3D by Vconf -m prep SDfile
Find this compound or compounds like it in BindingDB:
Activity Spreadsheet -- Enzyme Inhibition Constant Data from BindingDB
Found 2 hits for monomerid = 50121447
TargetGlutathione reductase, mitochondrial(Homo sapiens (Human))
Umr 8525 Cnrs-Université
Curated by ChEMBL
LigandPNGBDBM50121447(5-Nitro-furan-2-carboxylic acid N'-(2-naphthalen-2...)
Affinity DataIC50:  4.10nM. Assay description: Inhibitory concentration against human glutathione reductase
In DepthDetails ArticlePubMed
TargetTrypanothione reductase(Trypanosoma cruzi)
Université
Curated by ChEMBL
LigandPNGBDBM50121447(5-Nitro-furan-2-carboxylic acid N'-(2-naphthalen-2...)
Affinity DataIC50: >2.50E+4nM. Assay description: Compound was tested for inhibition of trypanothione reductase from Trypanosoma cruzi
In DepthDetails ArticlePubMed