BDBM50130466 CHEMBL105556::Methanesulfonic acid 3-(1-methyl-piperidin-4-yl)-1H-pyrrolo[3,2-b]pyridin-5-yl ester
SMILES CN1CCC(CC1)c1c[nH]c2ccc(OS(C)(=O)=O)nc12
InChI Key InChIKey=XCVHMFKWHHDTMW-UHFFFAOYSA-N
Data  3 KI
  Tab Delimited (TSV)   2D SDfile   Computed 3D by Vconf -m prep SDfile
Find this compound or compounds like it in BindingDB:
Activity Spreadsheet -- Enzyme Inhibition Constant Data from BindingDB
Found 3 hits for monomerid = 50130466
Target5-hydroxytryptamine receptor 1F(Homo sapiens (Human))
Eli Lilly
Curated by ChEMBL
LigandPNGBDBM50130466(CHEMBL105556 | Methanesulfonic acid 3-(1-methyl-pi...)
Affinity DataKi:  4.70nM. Assay description: In vitro binding affinity was determined by radioligand binding assay using cell line expressing human 5-hydroxytryptamine 1F receptor
In DepthDetails ArticlePubMed
Target5-hydroxytryptamine receptor 1D(Homo sapiens (Human))
Eli Lilly
Curated by ChEMBL
LigandPNGBDBM50130466(CHEMBL105556 | Methanesulfonic acid 3-(1-methyl-pi...)
Affinity DataKi:  8nM. Assay description: In vitro binding affinity of the compound was determined by radioligand binding assay using cell line expressing human 5-hydroxytryptamine 1D recepto...
In DepthDetails ArticlePubMed
Target5-hydroxytryptamine receptor 1B(Homo sapiens (Human))
Eli Lilly
Curated by ChEMBL
LigandPNGBDBM50130466(CHEMBL105556 | Methanesulfonic acid 3-(1-methyl-pi...)
Affinity DataKi:  25nM. Assay description: In vitro binding affinity of the compound was determined by radioligand binding assay using cell line expressing human 5-hydroxytryptamine 1B recepto...
In DepthDetails ArticlePubMed