BDBM50132107 9-Methyl-2-(3-phenoxy-propyl)-2,3,4,9-tetrahydro-1H-beta-carboline::CHEMBL126823
SMILES Cn1c2CN(CCCOc3ccccc3)CCc2c2ccccc12
InChI Key InChIKey=CCYIBILFEHSIOJ-UHFFFAOYSA-N
Data  4 KI
  Tab Delimited (TSV)   2D SDfile   Computed 3D by Vconf -m prep SDfile
Find this compound or compounds like it in BindingDB:
Activity Spreadsheet -- Enzyme Inhibition Constant Data from BindingDB
Found 4 hits for monomerid = 50132107
Target5-hydroxytryptamine receptor 2A(Rattus norvegicus (rat))
Virginia Commonwealth University
Curated by ChEMBL
LigandPNGBDBM50132107(9-Methyl-2-(3-phenoxy-propyl)-2,3,4,9-tetrahydro-1...)
Affinity DataKi:  150nM. Assay description: Binding affinity towards rat 5-hydroxytryptamine 2A receptor expressed in NIH3T3 cells using [3H]ketanserin as radioligand
In DepthDetails ArticlePubMed
Target5-hydroxytryptamine receptor 5A(MOUSE)
Virginia Commonwealth University
Curated by ChEMBL
LigandPNGBDBM50132107(9-Methyl-2-(3-phenoxy-propyl)-2,3,4,9-tetrahydro-1...)
Affinity DataKi:  360nM. Assay description: Binding affinity towards mouse 5-hydroxytryptamine 5A receptor using LSD as radioligand
In DepthDetails ArticlePubMed
Target5-hydroxytryptamine receptor 2C(Rattus norvegicus (Rat))
Virginia Commonwealth University
Curated by ChEMBL
LigandPNGBDBM50132107(9-Methyl-2-(3-phenoxy-propyl)-2,3,4,9-tetrahydro-1...)
Affinity DataKi:  400nM. Assay description: Binding affinity towards rat 5-hydroxytryptamine 2C receptor expressed in A-9 cells using [3H]mesulergine as radioligand
In DepthDetails ArticlePubMed
Target5-hydroxytryptamine receptor 5A(Homo sapiens (Human))
Virginia Commonwealth University
Curated by ChEMBL
LigandPNGBDBM50132107(9-Methyl-2-(3-phenoxy-propyl)-2,3,4,9-tetrahydro-1...)
Affinity DataKi:  620nM. Assay description: Binding affinity towards human 5-hydroxytryptamine 5A receptor using LSD as radioligand
In DepthDetails ArticlePubMed