BDBM50132554 (S)-1-[(S)-2-(3,4,5-Trimethoxy-phenyl)-butyryl]-piperidine-2-carboxylic acid (R)-1-(3-carboxymethoxy-phenyl)-3-phenyl-propyl ester::CHEMBL320478
SMILES CC[C@H](C(=O)N1CCCC[C@H]1C(=O)O[C@H](CCc1ccccc1)c1cccc(OCC(O)=O)c1)c1cc(OC)c(OC)c(OC)c1
InChI Key InChIKey=XPZJPDBDXOBEGK-OIFRRMEBSA-N
Data  1 IC50
  Tab Delimited (TSV)   2D SDfile   Computed 3D by Vconf -m prep SDfile
Find this compound or compounds like it in BindingDB:
Activity Spreadsheet -- Enzyme Inhibition Constant Data from BindingDB
Found 1 hit for monomerid = 50132554
TargetPeptidyl-prolyl cis-trans isomerase FKBP1A(Homo sapiens (Human))
Ariad Gene Therapeutics
Curated by ChEMBL
LigandPNGBDBM50132554((S)-1-[(S)-2-(3,4,5-Trimethoxy-phenyl)-butyryl]-pi...)
Affinity DataIC50:  5.5nM. Assay description: Inhibition of binding to Phe36Val (F36V) mutant of FK506 binding protein 12
In DepthDetails ArticlePubMed