BDBM50134020 CHEMBL141661::N,N'-(9-(3-acetamidophenylamino)acridine-3,6-diyl)bis(3-(pyrrolidin-1-yl)propanamide)::N-[9-(3-Acetylamino-phenylamino)-6-(3-pyrrolidin-1-yl-propionylamino)-acridin-3-yl]-3-pyrrolidin-1-yl-propionamide
SMILES CC(=O)Nc1cccc(Nc2c3ccc(NC(=O)CCN4CCCC4)cc3nc3cc(NC(=O)CCN4CCCC4)ccc23)c1
InChI Key InChIKey=MWDOKHARRXHUSQ-UHFFFAOYSA-N
Data  1 IC50  1 EC50
  Tab Delimited (TSV)   2D SDfile   Computed 3D by Vconf -m prep SDfile
Find this compound or compounds like it in BindingDB:
Activity Spreadsheet -- Enzyme Inhibition Constant Data from BindingDB
Found 2 hits for monomerid = 50134020
TargetTelomerase reverse transcriptase(Homo sapiens (Human))
Central University Of Las Villas
Curated by ChEMBL
LigandPNGBDBM50134020(CHEMBL141661 | N,N'-(9-(3-acetamidophenylamino)acr...)
Affinity DataIC50:  100nM. Assay description: Inhibition of telomerase in human A2780 cells by TRAP assay
In DepthDetails ArticlePubMed
TargetTelomerase reverse transcriptase(Homo sapiens (Human))
Central University Of Las Villas
Curated by ChEMBL
LigandPNGBDBM50134020(CHEMBL141661 | N,N'-(9-(3-acetamidophenylamino)acr...)
Affinity DataEC50:  100nM. Assay description: Inhibitory activity against human telomerase
In DepthDetails ArticlePubMed