BDBM50136908 CHEMBL153820::N-(7-Isobutylamino-3-methyl-1H-indazol-5-yl)-3-(2-methyl-pyrimidin-4-yl)-benzenesulfonamide
SMILES CC(C)CNc1cc(NS(=O)(=O)c2cccc(c2)-c2ccnc(C)n2)cc2c(C)n[nH]c12
InChI Key InChIKey=RKESDZNECJDTKA-UHFFFAOYSA-N
Data  1 KI
  Tab Delimited (TSV)   2D SDfile   Computed 3D by Vconf -m prep SDfile
Find this compound or compounds like it in BindingDB:
Activity Spreadsheet -- Enzyme Inhibition Constant Data from BindingDB
Found 1 hit for monomerid = 50136908
Target5'-methylthioadenosine/S-adenosylhomocysteine nucleosidase(Escherichia coli (strain K12))
Quorex Pharmaceuticals
Curated by ChEMBL
LigandPNGBDBM50136908(CHEMBL153820 | N-(7-Isobutylamino-3-methyl-1H-inda...)
Affinity DataKi:  191nM. Assay description: Inhibition of Escherichia coli S-adenosyl homocysteine/methylthioadenosine nucleosidase (MTA/SAH nucleosidase)
In DepthDetails ArticlePubMed