BDBM50138238 4-[3-(4-Imidazol-1-yl-phenoxy)-propyl]-pyridine::CHEMBL113227
SMILES C(COc1ccc(cc1)-n1ccnc1)Cc1ccncc1
InChI Key InChIKey=PFAUOLMRDJNYLJ-UHFFFAOYSA-N
Data  5 IC50
  Tab Delimited (TSV)   2D SDfile   Computed 3D by Vconf -m prep SDfile
Find this compound or compounds like it in BindingDB:
Activity Spreadsheet -- Enzyme Inhibition Constant Data from BindingDB
Found 5 hits for monomerid = 50138238
TargetCytochrome P450 2C9(Homo sapiens (Human))
Taisho Pharmaceutical
Curated by ChEMBL
LigandPNGBDBM50138238(4-[3-(4-Imidazol-1-yl-phenoxy)-propyl]-pyridine | ...)
Affinity DataIC50:  101nM. Assay description: Inhibition of cytochrome P450 2C9
In DepthDetails ArticlePubMed
TargetCytochrome P450 2D6(Homo sapiens (Human))
Taisho Pharmaceutical
Curated by ChEMBL
LigandPNGBDBM50138238(4-[3-(4-Imidazol-1-yl-phenoxy)-propyl]-pyridine | ...)
Affinity DataIC50:  1.04E+3nM. Assay description: Inhibition of cytochrome P450 2D6
In DepthDetails ArticlePubMed
TargetCytochrome P450 1A2(Homo sapiens (Human))
Taisho Pharmaceutical
Curated by ChEMBL
LigandPNGBDBM50138238(4-[3-(4-Imidazol-1-yl-phenoxy)-propyl]-pyridine | ...)
Affinity DataIC50: <46nM. Assay description: Inhibition of cytochrome P450 1A2
In DepthDetails ArticlePubMed
TargetCytochrome P450 2C19(Homo sapiens (Human))
Taisho Pharmaceutical
Curated by ChEMBL
LigandPNGBDBM50138238(4-[3-(4-Imidazol-1-yl-phenoxy)-propyl]-pyridine | ...)
Affinity DataIC50: <46nM. Assay description: Inhibition of cytochrome P450 2C19
In DepthDetails ArticlePubMed
TargetCytochrome P450 3A4(Homo sapiens (Human))
Taisho Pharmaceutical
Curated by ChEMBL
LigandPNGBDBM50138238(4-[3-(4-Imidazol-1-yl-phenoxy)-propyl]-pyridine | ...)
Affinity DataIC50:  344nM. Assay description: Inhibition of cytochrome P450 3A4
In DepthDetails ArticlePubMed