BDBM50139708 3-(4-Nitro-phenyl)-5-trifluoromethyl-1H-pyrazole::CHEMBL354344
SMILES [O-][N+](=O)c1ccc(cc1)-c1cc([nH]n1)C(F)(F)F
InChI Key InChIKey=KYOCIIJIVXLVDR-UHFFFAOYSA-N
Data  1 EC50
  Tab Delimited (TSV)   2D SDfile   Computed 3D by Vconf -m prep SDfile
Find this compound or compounds like it in BindingDB:
Activity Spreadsheet -- Enzyme Inhibition Constant Data from BindingDB
Found 1 hit for monomerid = 50139708
LigandPNGBDBM50139708(3-(4-Nitro-phenyl)-5-trifluoromethyl-1H-pyrazole |...)
Affinity DataEC50: >3.00E+4nM. Assay description: Maximum activation of human KATP (SUR1/Kir6.2) channel expressed in Xenopus oocytes
In DepthDetails ArticlePubMed