BDBM50142616 CHEMBL3759154
SMILES NC(Cc1cccc(c1)-c1cccc(O)c1)C(O)=O
InChI Key InChIKey=KLQKIRKWYATAMF-UHFFFAOYSA-N
Data  1 KI
PDB links: 1 PDB ID matches this monomer.
  Tab Delimited (TSV)   2D SDfile   Computed 3D by Vconf -m prep SDfile
Find this compound or compounds like it in BindingDB:
Activity Spreadsheet -- Enzyme Inhibition Constant Data from BindingDB
Found 1 hit for monomerid = 50142616
TargetGlutamate receptor ionotropic, kainate 1(RAT)
University Of Copenhagen
Curated by ChEMBL
LigandPNGBDBM50142616(CHEMBL3759154)
Affinity DataKi: >5.00E+4nM. Assay description: Displacement of [3H]SYM2081 from recombinant rat GluK1(Q)1b receptor expressed in sf9 cells incubated for 1 to 2 hrs by liquid scintillation counting...
In DepthDetails ArticlePubMed