BDBM50142904 CHEMBL3759969
SMILES CO[C@@H]1CN(CC2CCN(CC2)C(=O)OC)CC[C@@H]1NC(=O)c1cc(Cl)c(N)cc1OC
InChI Key InChIKey=DBZDEQRZDSXAQA-AZUAARDMSA-N
Data  2 IC50
  Tab Delimited (TSV)   2D SDfile   Computed 3D by Vconf -m prep SDfile
Find this compound or compounds like it in BindingDB:
Activity Spreadsheet -- Enzyme Inhibition Constant Data from BindingDB
Found 2 hits for monomerid = 50142904
Target5-hydroxytryptamine receptor 4(Homo sapiens (Human))
Sungkyunkwan University
Curated by ChEMBL
LigandPNGBDBM50142904(CHEMBL3759969)
Affinity DataIC50:  190nM. Assay description: Displacement of [3H]-GR113808 from human 5-HT4 receptor expressed in African green monkey COS7 cell membranes after 30 mins by liquid scintillation c...
In DepthDetails ArticlePubMed
TargetPotassium voltage-gated channel subfamily H member 2(Homo sapiens (Human))
Sungkyunkwan University
Curated by ChEMBL
LigandPNGBDBM50142904(CHEMBL3759969)
Affinity DataIC50:  1.00E+4nM. Assay description: Inhibition of human ERG channel by fluorescence polarization assay
In DepthDetails ArticlePubMed