BDBM50145944 CHEMBL3763540
SMILES CN1CCCN(Cc2ccc(cc2)-c2ccc(CN3CCCN(C)CC3)cc2C#N)CC1
InChI Key InChIKey=MJTWJYMXCDQAOT-UHFFFAOYSA-N
Data  1 IC50  1 Kd
PDB links: 1 PDB ID matches this monomer.
  Tab Delimited (TSV)   2D SDfile   Computed 3D by Vconf -m prep SDfile
Find this compound or compounds like it in BindingDB:
Activity Spreadsheet -- Enzyme Inhibition Constant Data from BindingDB
Found 2 hits for monomerid = 50145944
TargetCholine kinase alpha(Homo sapiens (Human))
Ariad Pharmaceuticals
Curated by ChEMBL
LigandPNGBDBM50145944(CHEMBL3763540)
Affinity DataKd:  10nM. Assay description: Binding affinity to human N-terminal truncated ChoKalpha1 (75 to 457 residues) by surface plasmon resonance assay
TargetCholine kinase alpha(Homo sapiens (Human))
Ariad Pharmaceuticals
Curated by ChEMBL
LigandPNGBDBM50145944(CHEMBL3763540)
Affinity DataIC50:  66nM. Assay description: Inhibition of human N-terminal truncated ChoKalpha1 (75 to 457 residues) using choline chloride as substrate measured over 10 to 30 mins by coupled A...