BDBM50147648 1-[5-Amino-2-(5-bromo-furan-2-yl)-[1,2,4]triazolo[1,5-a]pyridine-7-carbonyl]-piperidine-3-carboxylic acid diethylamide::CHEMBL332718
SMILES CCN(CC)C(=O)C1CCCN(C1)C(=O)c1cc(N)n2nc(nc2c1)-c1ccc(Br)o1
InChI Key InChIKey=LQZAHZGFSYNUER-UHFFFAOYSA-N
Data  1 KI
  Tab Delimited (TSV)   2D SDfile   Computed 3D by Vconf -m prep SDfile
Find this compound or compounds like it in BindingDB:
Activity Spreadsheet -- Enzyme Inhibition Constant Data from BindingDB
Found 1 hit for monomerid = 50147648
TargetAdenosine receptor A2a(Homo sapiens (Human))
F. Hoffmann-La Roche
Curated by ChEMBL
LigandPNGBDBM50147648(1-[5-Amino-2-(5-bromo-furan-2-yl)-[1,2,4]triazolo[...)
Affinity DataKi:  8nM. Assay description: Binding affinity against human Adenosine A2a receptor (hA2a)
In DepthDetails ArticlePubMed