BDBM50147661 CHEMBL325350::[5-Amino-2-(5-bromo-furan-2-yl)-[1,2,4]triazolo[1,5-a]pyridin-7-yl]-pyrrolidin-1-yl-methanone
SMILES Nc1cc(cc2nc(nn12)-c1ccc(Br)o1)C(=O)N1CCCC1
InChI Key InChIKey=VVRYFSHYYXQKHO-UHFFFAOYSA-N
Data  1 KI
  Tab Delimited (TSV)   2D SDfile   Computed 3D by Vconf -m prep SDfile
Find this compound or compounds like it in BindingDB:
Activity Spreadsheet -- Enzyme Inhibition Constant Data from BindingDB
Found 1 hit for monomerid = 50147661
TargetAdenosine receptor A2a(Homo sapiens (Human))
F. Hoffmann-La Roche
Curated by ChEMBL
LigandPNGBDBM50147661(CHEMBL325350 | [5-Amino-2-(5-bromo-furan-2-yl)-[1,...)
Affinity DataKi:  9nM. Assay description: Binding affinity against human Adenosine A2a receptor (hA2a)
In DepthDetails ArticlePubMed