BDBM50147671 8-Amino-2-(5-bromo-furan-2-yl)-[1,2,4]triazolo[1,5-a]pyridine-6-carboxylic acid methyl-phenethyl-amide::CHEMBL112740
SMILES CN(CCc1ccccc1)C(=O)c1cc(N)c2nc(nn2c1)-c1ccc(Br)o1
InChI Key InChIKey=VKKPJYXECVYOOR-UHFFFAOYSA-N
Data  1 KI
  Tab Delimited (TSV)   2D SDfile   Computed 3D by Vconf -m prep SDfile
Find this compound or compounds like it in BindingDB:
Activity Spreadsheet -- Enzyme Inhibition Constant Data from BindingDB
Found 1 hit for monomerid = 50147671
TargetAdenosine receptor A2a(Homo sapiens (Human))
F. Hoffmann-La Roche
Curated by ChEMBL
LigandPNGBDBM50147671(8-Amino-2-(5-bromo-furan-2-yl)-[1,2,4]triazolo[1,5...)
Affinity DataKi:  50nM. Assay description: Binding affinity against human Adenosine A2a receptor (hA2a)
In DepthDetails ArticlePubMed