BDBM50148914 CHEMBL3769528
SMILES OC[C@H]1O[C@H]([C@H](O)[C@@H](O)[C@@H]1O)c1nc(cs1)-c1ccccc1
InChI Key InChIKey=CQDQZIAPWGJSQJ-RKQHYHRCSA-N
Data  2 KI
PDB links: 1 PDB ID matches this monomer.
  Tab Delimited (TSV)   2D SDfile   Computed 3D by Vconf -m prep SDfile
Find this compound or compounds like it in BindingDB:
Activity Spreadsheet -- Enzyme Inhibition Constant Data from BindingDB
Found 2 hits for monomerid = 50148914
TargetGlycogen phosphorylase, liver form(Homo sapiens (Human))
University Of Thessaly
Curated by ChEMBL
LigandPNGBDBM50148914(CHEMBL3769528)
Affinity DataKi:  1.80E+5nM. Assay description: Inhibition of human liver GPa using Glc-1-P as substrate incubated for 15 mins
In DepthDetails ArticlePubMed
TargetGlycogen phosphorylase, muscle form(Oryctolagus cuniculus (rabbit))
University Of Debrecen
Curated by ChEMBL
LigandPNGBDBM50148914(CHEMBL3769528)
Affinity DataKi:  3.10E+5nM. Assay description: Competitive inhibition of rabbit muscle glycogen phosphorylase-b using alpha-D-glucose-1-phosphate as substrate by Dixon plot analysis