BDBM50150383 CHEMBL310174::[Methoxycarbonyl-(6-methoxy-5-trifluoromethyl-naphthalene-1-carbonyl)-amino]-acetic acid
SMILES COC(=O)N(CC(O)=O)C(=O)c1cccc2c(c(OC)ccc12)C(F)(F)F
InChI Key InChIKey=UHOFKENGYRPPMV-UHFFFAOYSA-N
Data  1 IC50
  Tab Delimited (TSV)   2D SDfile   Computed 3D by Vconf -m prep SDfile
Find this compound or compounds like it in BindingDB:
Activity Spreadsheet -- Enzyme Inhibition Constant Data from BindingDB
Found 1 hit for monomerid = 50150383
TargetRNA-directed RNA polymerase(Hepatitis C virus)
Wyeth Research
Curated by ChEMBL
LigandPNGBDBM50150383(CHEMBL310174 | [Methoxycarbonyl-(6-methoxy-5-trifl...)
Affinity DataIC50: >2.60E+4nM. Assay description: Inhibitory concentration against HCV NS5B RNA dependent RNA polymerase
In DepthDetails ArticlePubMed