BDBM50150430 CHEMBL183277::N*2*-[2-(4-Fluoro-phenoxy)-ethyl]-N*4*-((S)-1-phenyl-ethyl)-pyrimidine-2,4-diamine
SMILES C[C@H](Nc1ccnc(NCCOc2ccc(F)cc2)n1)c1ccccc1
InChI Key InChIKey=JXRVBGJBQOUHLR-HNNXBMFYSA-N
Data  2 KI
  Tab Delimited (TSV)   2D SDfile   Computed 3D by Vconf -m prep SDfile
Find this compound or compounds like it in BindingDB:
Activity Spreadsheet -- Enzyme Inhibition Constant Data from BindingDB
Found 2 hits for monomerid = 50150430
Target5-hydroxytryptamine receptor 7(Homo sapiens (Human))
Bristol-Myers Squibb Pharmaceutical Research Institute
Curated by ChEMBL
LigandPNGBDBM50150430(CHEMBL183277 | N*2*-[2-(4-Fluoro-phenoxy)-ethyl]-N...)
Affinity DataKi:  0.300nM. Assay description: Binding affinity against 5-Hydroxy tryptamine 7 receptor
In DepthDetails ArticlePubMed
TargetD(2) dopamine receptor(Homo sapiens (Human))
Bristol-Myers Squibb Pharmaceutical Research Institute
Curated by ChEMBL
LigandPNGBDBM50150430(CHEMBL183277 | N*2*-[2-(4-Fluoro-phenoxy)-ethyl]-N...)
Affinity DataKi: >1.00E+3nM. Assay description: Binding affinity against D2L receptor
In DepthDetails ArticlePubMed